Target
Interleukin-1 receptor-associated kinase 1
Ligand
BDBM50040744
Substrate
Meas. Tech.
ChEMBL_1444377 (CHEMBL3372368)
IC50
<100±n/a nM
Citation
 Chaudhary, DRobinson, SRomero, DL Recent advances in the discovery of small molecule inhibitors of interleukin-1 receptor-associated kinase 4 (IRAK4) as a therapeutic target for inflammation and oncology disorders. J Med Chem 58:96-110 (2015)  
Target
Name:
Interleukin-1 receptor-associated kinase 1
Synonyms:
IRAK IRAK1 Interleukin-1 receptor-associated kinase 1 (IRAK-1)
Type:
Enzyme
Mol. Mass.:
76536.81
Organism:
Homo sapiens (Human)
Description:
P51617
Residue:
712
  
Inhibitor
Name:
BDBM50040744
Synonyms:
CHEMBL3353213
Type:
Small organic molecule
Emp. Form.:
C25H20N6O3
Mol. Mass.:
452.4647
SMILES:
OCc1ccc2nc(NC(=O)c3cccc(Cn4nc(ccc4=O)-c4cccnc4)c3)[nH]c2c1
: