Target
Interleukin-1 receptor-associated kinase 4
Ligand
BDBM50040792
Substrate
Meas. Tech.
ChEMBL_1444243 (CHEMBL3380182)
IC50
1.5±n/a nM
Citation
 Chaudhary, DRobinson, SRomero, DL Recent advances in the discovery of small molecule inhibitors of interleukin-1 receptor-associated kinase 4 (IRAK4) as a therapeutic target for inflammation and oncology disorders. J Med Chem 58:96-110 (2015)  
Target
Name:
Interleukin-1 receptor-associated kinase 4
Synonyms:
IRAK-4 IRAK4_HUMAN Interleukin-1 receptor-associated kinase 4 (IRAK4) | Renal carcinoma antigen NY-REN-64
Type:
Protein
Mol. Mass.:
51519.08
Organism:
Homo sapiens (Human)
Description:
Q9NWZ3
Residue:
460
  
Inhibitor
Name:
BDBM50040792
Synonyms:
CHEMBL3353195 | US9546153, ex. 510
Type:
Small organic molecule
Emp. Form.:
C25H31N7O3S
Mol. Mass.:
509.624
SMILES:
CNC(=O)[C@H]1CC[C@@H](CC1)NC(=O)c1cnc(Nc2ccc3ncsc3n2)cc1NC1CCOCC1
: