Target
Adenosine receptor A3
Ligand
BDBM50041205
Substrate
Meas. Tech.
ChEMBL_1445856 (CHEMBL3376724)
Ki
25±n/a nM
Citation
 Catarzi, DVarano, FPoli, DSquarcialupi, LBetti, MTrincavelli, LMartini, CDal Ben, DThomas, AVolpini, RColotta, V 1,2,4-triazolo[1,5-a]quinoxaline derivatives and their simplified analogues as adenosine A3 receptor antagonists. Synthesis, structure-affinity relationships and molecular modeling studies. Bioorg Med Chem 23:9-21 (2014)  
Target
Name:
Adenosine receptor A3
Synonyms:
A3 adenosine receptor (hA3) ADORA3 | Adenosine A3 receptor (A3AR)
Type:
G Protein-Coupled Receptor (GPCR)
Mol. Mass.:
36197.32
Organism:
Homo sapiens (Human)
Description:
P0DMS8
Residue:
318
  
Inhibitor
Name:
BDBM50041205
Synonyms:
CHEMBL3355975
Type:
Small organic molecule
Emp. Form.:
C20H20N4O2
Mol. Mass.:
348.3984
SMILES:
CCC(=O)N1Cc2nc(nn2-c2cc(C)ccc12)-c1ccc(OC)cc1
: