Target
Induced myeloid leukemia cell differentiation protein Mcl-1
Ligand
BDBM50041679
Substrate
Meas. Tech.
ChEMBL_1445980 (CHEMBL3378542)
Kd
6000±n/a nM
Citation
 Fang, CD'Souza, BThompson, CFClifton, MCFairman, JWFulroth, BLeed, AMcCarren, PWang, LWang, YFeau, CKaushik, VKPalmer, MWei, GGolub, TRHubbard, BKSerrano-Wu, MH Single Diastereomer of a Macrolactam Core Binds Specifically to Myeloid Cell Leukemia 1 (MCL1). ACS Med Chem Lett 5:1308-12 (2014)  
Target
Name:
Induced myeloid leukemia cell differentiation protein Mcl-1
Synonyms:
BCL2L3 Bcl-2-like protein 3 (Mcl-1) Bcl2-L-3 MCL1 Mcl-1 Myeloid cell leukemia sequence 1 (BCL2-related) | mcl1/EAT
Type:
Membrane; Single-pass membrane protein
Mol. Mass.:
37332.87
Organism:
Homo sapiens (Human)
Description:
Q07820
Residue:
350
  
Inhibitor
Name:
BDBM50041679
Synonyms:
CHEMBL3358892
Type:
Small organic molecule
Emp. Form.:
C30H30F4N4O7S
Mol. Mass.:
666.64
SMILES:
C[C@H](N1C[C@@H](C)[C@@H](CN(C)C(=O)Nc2ccc(cc2)C(F)(F)F)Oc2c(NS(=O)(=O)c3ccc(F)cc3)cccc2C1=O)C(O)=O
: