Target
Integrase
Ligand
BDBM50042010
Substrate
Meas. Tech.
ChEMBL_1443856 (CHEMBL3373530)
IC50
10.0±n/a nM
Citation
 Naidu, BNSorenson, MEPatel, MUeda, YBanville, JBeaulieu, FBollini, SDicker, IBHigley, HLin, ZPajor, LParker, DDTerry, BJZheng, MMartel, AMeanwell, NAKrystal, MWalker, MA Synthesis and evaluation of C2-carbon-linked heterocyclic-5-hydroxy-6-oxo-dihydropyrimidine-4-carboxamides as HIV-1 integrase inhibitors. Bioorg Med Chem Lett 25:717-20 (2015)  
Target
Name:
Integrase
Synonyms:
pol
Type:
PROTEIN
Mol. Mass.:
32203.43
Organism:
Human immunodeficiency virus 1
Description:
ChEMBL_106649
Residue:
288
  
Inhibitor
Name:
BDBM50042010
Synonyms:
CHEMBL3360117
Type:
Small organic molecule
Emp. Form.:
C18H20FN3O4
Mol. Mass.:
361.3675
SMILES:
Cn1c(nc(C(=O)NCc2ccc(F)cc2)c(O)c1=O)C1CCCCO1
: