Target
Integrase
Ligand
BDBM50042015
Substrate
Meas. Tech.
ChEMBL_1443856 (CHEMBL3373530)
IC50
12±n/a nM
Citation
 Naidu, BNSorenson, MEPatel, MUeda, YBanville, JBeaulieu, FBollini, SDicker, IBHigley, HLin, ZPajor, LParker, DDTerry, BJZheng, MMartel, AMeanwell, NAKrystal, MWalker, MA Synthesis and evaluation of C2-carbon-linked heterocyclic-5-hydroxy-6-oxo-dihydropyrimidine-4-carboxamides as HIV-1 integrase inhibitors. Bioorg Med Chem Lett 25:717-20 (2015)  
Target
Name:
Integrase
Synonyms:
pol
Type:
PROTEIN
Mol. Mass.:
32203.43
Organism:
Human immunodeficiency virus 1
Description:
ChEMBL_106649
Residue:
288
  
Inhibitor
Name:
BDBM50042015
Synonyms:
CHEMBL3360122
Type:
Small organic molecule
Emp. Form.:
C20H21FN6O4
Mol. Mass.:
428.4169
SMILES:
Cc1ncnn1-c1cc(F)ccc1CNC(=O)c1nc(C2CCOC2)n(C)c(=O)c1O
: