Target
Integrase
Ligand
BDBM50042031
Substrate
Meas. Tech.
ChEMBL_1443856 (CHEMBL3373530)
IC50
6.0±n/a nM
Citation
 Naidu, BNSorenson, MEPatel, MUeda, YBanville, JBeaulieu, FBollini, SDicker, IBHigley, HLin, ZPajor, LParker, DDTerry, BJZheng, MMartel, AMeanwell, NAKrystal, MWalker, MA Synthesis and evaluation of C2-carbon-linked heterocyclic-5-hydroxy-6-oxo-dihydropyrimidine-4-carboxamides as HIV-1 integrase inhibitors. Bioorg Med Chem Lett 25:717-20 (2015)  
Target
Name:
Integrase
Synonyms:
pol
Type:
PROTEIN
Mol. Mass.:
32203.43
Organism:
Human immunodeficiency virus 1
Description:
ChEMBL_106649
Residue:
288
  
Inhibitor
Name:
BDBM50042031
Synonyms:
CHEMBL3360137
Type:
Small organic molecule
Emp. Form.:
C23H30FN5O6S
Mol. Mass.:
523.578
SMILES:
CN1C(C)(C)CN(c2cc(F)ccc2CNC(=O)c2nc(C3CCOCC3)n(C)c(=O)c2O)S1(=O)=O
: