Target
Beta-secretase 1
Ligand
BDBM50042296
Substrate
Meas. Tech.
ChEMBL_1444279 (CHEMBL3380862)
Ki
0.250000±n/a nM
Citation
 Ghosh, AKBrindisi, MYen, YCXu, XHuang, XDevasamudram, TBilcer, GLei, HKoelsch, GMesecar, ADTang, J Structure-based design, synthesis and biological evaluation of novelß-secretase inhibitors containing a pyrazole or thiazole moiety as the P3 ligand. Bioorg Med Chem Lett 25:668-72 (2015)  
Target
Name:
Beta-secretase 1
Synonyms:
ASP2 Aspartyl protease 2 BACE1 Beta-secretase (BACE) Beta-secretase 1 (BACE 1) Beta-secretase 1 (BACE1) Beta-site amyloid precursor protein cleaving enzyme 1 Memapsin-2 beta-Secretase (BACE-1) | beta-Secretase (BACE1)
Type:
Protein
Mol. Mass.:
55755.10
Organism:
Homo sapiens (Human)
Description:
P56817
Residue:
501
  
Inhibitor
Name:
BDBM50042296
Synonyms:
CHEMBL3352906
Type:
Small organic molecule
Emp. Form.:
C35H62N6O7S
Mol. Mass.:
710.968
SMILES:
CC(C)CNC(=O)[C@@H](NC(=O)[C@H](C)C[C@H](O)[C@H](CC(C)C)NC(=O)[C@H](CNC(=O)OC(C)(C)C)NC(=O)[C@@H](C)Cc1nc(C)cs1)C(C)C
: