Target
Cannabinoid receptor 1
Ligand
BDBM50006232
Substrate
Meas. Tech.
ChEMBL_1444457 (CHEMBL3373565)
EC50
1400±n/a nM
Citation
 Riether, DZindell, RWu, LBetageri, RJenkins, JEKhor, SBerry, AKHickey, ERErmann, MAlbrecht, CCeci, AGemkow, MJNagaraja, NVRomig, HSauer, AThomson, DS Selective CB2 receptor agonists. Part 2: Structure-activity relationship studies and optimization of proline-based compounds. Bioorg Med Chem Lett 25:581-6 (2015)  
Target
Name:
Cannabinoid receptor 1
Synonyms:
CANN6 CB-R CNR CNR1_HUMAN Cannabinoid receptor Cannabinoid receptor 1 (brain)
Type:
G Protein-Coupled Receptor (GPCR)
Mol. Mass.:
52868.96
Organism:
Homo sapiens (Human)
Description:
P21554
Residue:
472
  
Inhibitor
Name:
BDBM50006232
Synonyms:
CHEMBL3235058
Type:
Small organic molecule
Emp. Form.:
C17H19F3N4O2
Mol. Mass.:
368.3536
SMILES:
CC(C)(C)c1cc(NC(=O)[C@@H]2CCN2c2ccc(cn2)C(F)(F)F)no1
: