Target
Cannabinoid receptor 1
Ligand
BDBM50042912
Substrate
Meas. Tech.
ChEMBL_1444656 (CHEMBL3376654)
EC50
>20000±n/a nM
Citation
 Bartolozzi, ACirillo, PFBerry, AKHickey, ERThomson, DSWu, LZindell, RAlbrecht, CCeci, AGemkow, MJNagaraja, NVRomig, HSauer, ARiether, D Selective CB2 receptor agonists. Part 3: the optimization of a piperidine-based series that demonstrated efficacy in an in vivo neuropathic pain model. Bioorg Med Chem Lett 25:587-92 (2015)  
Target
Name:
Cannabinoid receptor 1
Synonyms:
Brain-type cannabinoid receptor CB-R CNR1_RAT Cannabinoid receptor Cnr1 | Skr6
Type:
G Protein-Coupled Receptor (GPCR)
Mol. Mass.:
52856.55
Organism:
Rattus norvegicus (rat)
Description:
P20272
Residue:
473
  
Inhibitor
Name:
BDBM50042912
Synonyms:
CHEMBL3354553
Type:
Small organic molecule
Emp. Form.:
C18H28N4O5S
Mol. Mass.:
412.504
SMILES:
CC(C)(C)c1cc(NC(=O)[C@@H]2CCCCN2C(=O)N2CCS(=O)(=O)CC2)no1
: