Target
Phosphatidylinositol 4-phosphate 3-kinase C2 domain-containing subunit alpha
Ligand
BDBM50042925
Substrate
Meas. Tech.
ChEMBL_1444671 (CHEMBL3376669)
IC50
140±n/a nM
Citation
 Mountford, SJZheng, ZSundaram, KJennings, IGHamilton, JRThompson, PE Class II but Not Second Class-Prospects for the Development of Class II PI3K Inhibitors. ACS Med Chem Lett 6:3-6 (2015)  
Target
Name:
Phosphatidylinositol 4-phosphate 3-kinase C2 domain-containing subunit alpha
Synonyms:
P3C2A_HUMAN PIK3C2A Phosphatidylinositol-4-phosphate 3-kinase C2 domain-containing subunit alpha PtdIns-3-kinase C2 subunit alpha
Type:
Protein
Mol. Mass.:
190704.50
Organism:
Homo sapiens (Human)
Description:
O00443
Residue:
1686
  
Inhibitor
Name:
BDBM50042925
Synonyms:
CHEMBL3218571
Type:
Small organic molecule
Emp. Form.:
C19H12ClFN2O3S2
Mol. Mass.:
434.892
SMILES:
Fc1ccc(CN2C(=O)COc3ccc(\C=C4\SC(=S)NC4=O)cc23)cc1Cl
: