Target
MAP kinase-interacting serine/threonine-protein kinase 1
Ligand
BDBM50042937
Substrate
Meas. Tech.
ChEMBL_1444683 (CHEMBL3377245)
IC50
3540±n/a nM
Citation
 Brazeau, JFRosse, G Pyrrolopyrimidine Analogues as MKNK Inhibitors. ACS Med Chem Lett 6:9-10 (2015)  
Target
Name:
MAP kinase-interacting serine/threonine-protein kinase 1
Synonyms:
MAP Kinase-Interacting Protein Kinase (MNK1) MAP kinase-interacting serine/threonine-protein kinase 1 (MnK1) MAP-kinase interacting kinase 1 (MNK1) MKNK1 MNK1
Type:
Serine/threonine-protein kinase
Mol. Mass.:
51342.85
Organism:
Homo sapiens (Human)
Description:
Q9BUB5
Residue:
465
  
Inhibitor
Name:
BDBM50042937
Synonyms:
CHEMBL3355001
Type:
Small organic molecule
Emp. Form.:
C19H17FN4O3
Mol. Mass.:
368.3617
SMILES:
Fc1ccc2Nc3ncnc4[nH]c5CCC(Cc5c34)C(=O)OCCOc2c1
: