Target
Serine/threonine-protein kinase ATR
Ligand
BDBM50043385
Substrate
Meas. Tech.
ChEMBL_1444858 (CHEMBL3379628)
IC50
0.300000±n/a nM
Citation
 Barsanti, PAAversa, RJJin, XPan, YLu, YElling, RJain, RKnapp, MLan, JLin, XRudewicz, PSim, JTaricani, LThomas, GXiao, LYue, Q Structure-Based Drug Design of Novel Potent and Selective Tetrahydropyrazolo[1,5-a]pyrazines as ATR Inhibitors. ACS Med Chem Lett 6:37-41 (2015)  
Target
Name:
Serine/threonine-protein kinase ATR
Synonyms:
ATR Ataxia telangiectasia and Rad3-related protein (ATR) FRP1 | Serine-protein kinase ATR
Type:
Protein
Mol. Mass.:
301404.58
Organism:
Homo sapiens (Human)
Description:
Q13535
Residue:
2644
  
Inhibitor
Name:
BDBM50043385
Synonyms:
CHEMBL3355072
Type:
Small organic molecule
Emp. Form.:
C21H21N5O2S
Mol. Mass.:
407.489
SMILES:
C[C@@H]1Cn2ncc(c2CN1c1ccnc2[nH]ccc12)-c1ccc(cc1)S(C)(=O)=O
: