Target
Serine/threonine-protein kinase ATR
Ligand
BDBM50043386
Substrate
Meas. Tech.
ChEMBL_1444858 (CHEMBL3379628)
IC50
1.000000±n/a nM
Citation
 Barsanti, PAAversa, RJJin, XPan, YLu, YElling, RJain, RKnapp, MLan, JLin, XRudewicz, PSim, JTaricani, LThomas, GXiao, LYue, Q Structure-Based Drug Design of Novel Potent and Selective Tetrahydropyrazolo[1,5-a]pyrazines as ATR Inhibitors. ACS Med Chem Lett 6:37-41 (2015)  
Target
Name:
Serine/threonine-protein kinase ATR
Synonyms:
ATR Ataxia telangiectasia and Rad3-related protein (ATR) FRP1 | Serine-protein kinase ATR
Type:
Protein
Mol. Mass.:
301404.58
Organism:
Homo sapiens (Human)
Description:
Q13535
Residue:
2644
  
Inhibitor
Name:
BDBM50043386
Synonyms:
CHEMBL3355073
Type:
Small organic molecule
Emp. Form.:
C20H26N6O2S
Mol. Mass.:
414.524
SMILES:
C[C@@H]1Cn2ncc(C3CCN(CC3)S(C)(=O)=O)c2CN1c1ccnc2[nH]ccc12
: