Target
Potassium voltage-gated channel subfamily H member 2
Ligand
BDBM50043662
Substrate
Meas. Tech.
ChEMBL_1445162 (CHEMBL3375414)
IC50
>30000±n/a nM
Citation
 Xu, YBrenning, BGKultgen, SGFoulks, JMClifford, ALai, SChan, AMerx, SMcCullar, MVKanner, SBHo, KK Synthesis and Biological Evaluation of Pyrazolo[1,5-a]pyrimidine Compounds as Potent and Selective Pim-1 Inhibitors. ACS Med Chem Lett 6:63-7 (2015)  
Target
Name:
Potassium voltage-gated channel subfamily H member 2
Synonyms:
1,3-beta-glucan synthase component GLS2 ERG Eag-related protein 1 Ether-a-go-go-related gene (HERG) Ether-a-go-go-related gene potassium channel 1 Ether-a-go-go-related gene potassium channel 1 (hERG1) Ether-a-go-go-related protein 1 H-ERG KCNH2 Potassium voltage-gated channel subfamily H member 2 (hERG) Voltage-gated potassium channel subunit Kv11.1 hERG Potassium Channel 1 | putative potassium channel subunit
Type:
Multi-pass membrane protein
Mol. Mass.:
126672.65
Organism:
Homo sapiens (Human)
Description:
Q12809
Residue:
1159
  
Inhibitor
Name:
BDBM50043662
Synonyms:
CHEMBL3355552 US10392392, Example 8-56 US9416132, 8-56
Type:
Small organic molecule
Emp. Form.:
C22H25F3N4O
Mol. Mass.:
418.4553
SMILES:
CC(C)(O)[C@H]1CC[C@@H](CC1)Nc1ccn2ncc(-c3cccc(c3)C(F)(F)F)c2n1
: