Target
Farnesyl pyrophosphate synthase
Ligand
BDBM36511
Substrate
Meas. Tech.
ChEMBL_1454339 (CHEMBL3364478)
IC50
80±n/a nM
Citation
 Abet, VMariani, ATruscott, FRBritton, SRodriguez, R Biased and unbiased strategies to identify biologically active small molecules. Bioorg Med Chem 22:4474-89 (2014)  
Target
Name:
Farnesyl pyrophosphate synthase
Synonyms:
Dimethylallyltranstransferase FPP synthase FPPS_HUMAN Farnesyl diphosphate synthase Farnesyl diphosphate synthetase Farnesyl pyrophosphate synthetase KIAA1293 | P14324
Type:
Enzyme
Mol. Mass.:
48272.89
Organism:
Homo sapiens (Human)
Description:
P14324
Residue:
419
  
Inhibitor
Name:
BDBM36511
Synonyms:
5-((2-Carboxy-1H-benzo[g]indol-1-yl)methyl)isoxazole-3-carboxylic acid, 12 | CID46398842
Type:
Small organic molecule
Emp. Form.:
C18H12N2O5
Mol. Mass.:
336.2983
SMILES:
OC(=O)c1cc(Cn2c(cc3ccc4ccccc4c23)C(O)=O)on1
: