Target
Aurora kinase A
Ligand
BDBM24637
Substrate
Meas. Tech.
ChEMBL_1454337 (CHEMBL3364476)
IC50
910±n/a nM
Citation
 Abet, VMariani, ATruscott, FRBritton, SRodriguez, R Biased and unbiased strategies to identify biologically active small molecules. Bioorg Med Chem 22:4474-89 (2014)  
Target
Name:
Aurora kinase A
Synonyms:
AIK ARK1 AURKA AYK1 Aurora kinase A (AURA) Aurora kinase A (Aurora A) Aurora-related kinase 1 BTAK Breast-tumor-amplified kinase STK15 Serine/threonine kinase 15 Serine/threonine-protein kinase aurora A hARK1
Type:
Serine/threonine-protein kinase
Mol. Mass.:
45830.98
Organism:
Homo sapiens (Human)
Description:
O14965
Residue:
403
  
Inhibitor
Name:
BDBM24637
Synonyms:
2-(1H-pyrazol-3-yl)-1H-1,3-benzodiazole pyrazole-benzimidazole, 16
Type:
Small organic molecule
Emp. Form.:
C10H8N4
Mol. Mass.:
184.1973
SMILES:
c1cc(n[nH]1)-c1nc2ccccc2[nH]1
: