Target
Transcription factor Jun
Ligand
BDBM50180049
Substrate
Meas. Tech.
ChEMBL_1458005 (CHEMBL3367179)
IC50
5000±n/a nM
Citation
 Ye, NDing, YWild, CShen, QZhou, J Small molecule inhibitors targeting activator protein 1 (AP-1). J Med Chem 57:6930-48 (2014)  
Target
Name:
Transcription factor Jun
Synonyms:
AP1 JUN Proto-oncogene c-JUN Transcription factor AP1 p39
Type:
Mol. Mass.:
35683.24
Organism:
Homo sapiens (Human)
Description:
P05412
Residue:
331
  
Inhibitor
Name:
BDBM50180049
Synonyms:
3-[2-isobutoxy-5-(4-isobutoxybenzoyl)phenyl]propionic acid | CHEMBL200061
Type:
Small organic molecule
Emp. Form.:
C24H30O5
Mol. Mass.:
398.492
SMILES:
CC(C)COc1ccc(cc1)C(=O)c1ccc(OCC(C)C)c(CCC(O)=O)c1
: