Target
Transcription factor Jun
Ligand
BDBM50044568
Substrate
Meas. Tech.
ChEMBL_1457997 (CHEMBL3367171)
IC50
35±n/a nM
Citation
 Ye, NDing, YWild, CShen, QZhou, J Small molecule inhibitors targeting activator protein 1 (AP-1). J Med Chem 57:6930-48 (2014)  
Target
Name:
Transcription factor Jun
Synonyms:
AP1 JUN Proto-oncogene c-JUN Transcription factor AP1 p39
Type:
Mol. Mass.:
35683.24
Organism:
Homo sapiens (Human)
Description:
P05412
Residue:
331
  
Inhibitor
Name:
BDBM50044568
Synonyms:
CHEMBL85822
Type:
Small organic molecule
Emp. Form.:
C15H18N4O4
Mol. Mass.:
318.3278
SMILES:
CCOC(=O)c1cnc(nc1CC)N(C)N1C(=O)C=C(C)C1=O
: