Target
Transcription factor Jun
Ligand
BDBM50044580
Substrate
Meas. Tech.
ChEMBL_1457997 (CHEMBL3367171)
IC50
10000±n/a nM
Citation
 Ye, NDing, YWild, CShen, QZhou, J Small molecule inhibitors targeting activator protein 1 (AP-1). J Med Chem 57:6930-48 (2014)  
Target
Name:
Transcription factor Jun
Synonyms:
AP1 JUN Proto-oncogene c-JUN Transcription factor AP1 p39
Type:
Mol. Mass.:
35683.24
Organism:
Homo sapiens (Human)
Description:
P05412
Residue:
331
  
Inhibitor
Name:
BDBM50044580
Synonyms:
CHEMBL3341905
Type:
Small organic molecule
Emp. Form.:
C15H8ClF6N3O2
Mol. Mass.:
411.686
SMILES:
FC(F)(F)c1ccc2COCN(C(=O)c3cnc(Cl)nc3C(F)(F)F)c2c1
: