Target
Transcription factor Jun
Ligand
BDBM50092877
Substrate
Meas. Tech.
ChEMBL_1457997 (CHEMBL3367171)
IC50
100±n/a nM
Citation
 Ye, NDing, YWild, CShen, QZhou, J Small molecule inhibitors targeting activator protein 1 (AP-1). J Med Chem 57:6930-48 (2014)  
Target
Name:
Transcription factor Jun
Synonyms:
AP1 JUN Proto-oncogene c-JUN Transcription factor AP1 p39
Type:
Mol. Mass.:
35683.24
Organism:
Homo sapiens (Human)
Description:
P05412
Residue:
331
  
Inhibitor
Name:
BDBM50092877
Synonyms:
2-Fluoro-4-trifluoromethyl-pyrimidine-5-carboxylic acid (3,5-bis-trifluoromethyl-phenyl)-amide | CHEMBL131006
Type:
Small organic molecule
Emp. Form.:
C14H5F10N3O
Mol. Mass.:
421.193
SMILES:
Fc1ncc(C(=O)Nc2cc(cc(c2)C(F)(F)F)C(F)(F)F)c(n1)C(F)(F)F
: