Target
Double-strand break repair protein MRE11
Ligand
BDBM50044627
Substrate
Meas. Tech.
ChEMBL_1446574 (CHEMBL3377973)
IC50
12000±n/a nM
Citation
 Huang, FMazin, AV Targeting the homologous recombination pathway by small molecule modulators. Bioorg Med Chem Lett 24:3006-13 (2014)  
Target
Name:
Double-strand break repair protein MRE11
Synonyms:
Double-strand break repair protein MRE11A HNGS1 MRE11 homolog 1 MRE11A Meiotic recombination 11 homolog 1 | Meiotic recombination 11 homolog A
Type:
PROTEIN
Mol. Mass.:
80583.26
Organism:
Homo sapiens (Human)
Description:
ChEMBL_109117
Residue:
708
  
Inhibitor
Name:
BDBM50044627
Synonyms:
Mirin
Type:
Small organic molecule
Emp. Form.:
C10H8N2O2S
Mol. Mass.:
220.248
SMILES:
Oc1ccc(cc1)-c1cc(=O)[nH]c(=S)[nH]1
: