Target
Free fatty acid receptor 4
Ligand
BDBM50044846
Substrate
Meas. Tech.
ChEMBL_1454419 (CHEMBL3364891)
EC50
10000±n/a nM
Citation
 Sparks, SMChen, GCollins, JLDanger, DDock, STJayawickreme, CJenkinson, SLaudeman, CLeesnitzer, MALiang, XMaloney, PMcCoy, DCMoncol, DRash, VRimele, TVulimiri, PWay, JMRoss, S Identification of diarylsulfonamides as agonists of the free fatty acid receptor 4 (FFA4/GPR120). Bioorg Med Chem Lett 24:3100-3 (2014)  
Target
Name:
Free fatty acid receptor 4
Synonyms:
FFAR4 G-protein coupled receptor 120 G-protein coupled receptor GT01 GPR120 O3FAR1 PGR4
Type:
PROTEIN
Mol. Mass.:
42256.91
Organism:
Homo sapiens (Human)
Description:
ChEMBL_1508994
Residue:
377
  
Inhibitor
Name:
BDBM50044846
Synonyms:
CHEMBL3311324
Type:
Small organic molecule
Emp. Form.:
C17H21NO4S
Mol. Mass.:
335.418
SMILES:
COc1ccc(cc1OC)S(=O)(=O)Nc1c(C)cc(C)cc1C
: