Target
Egl nine homolog 1
Ligand
BDBM50044979
Substrate
Meas. Tech.
ChEMBL_1451795 (CHEMBL3362036)
IC50
13500±n/a nM
Citation
 Hong, YRKim, HTRo, SCho, JMLee, SHKim, ISJung, YH Discovery of novel 2-[2-(3-hydroxy-pyridin-2-yl)-thiazol-4-yl]-acetamide derivatives as HIF prolyl 4-hydroxylase inhibitors; SAR, synthesis and modeling evaluation. Bioorg Med Chem Lett 24:3142-5 (2014)  
Target
Name:
Egl nine homolog 1
Synonyms:
C1orf12 EGLN1_HUMAN Hypoxia-inducible factor prolyl hydroxylase 2 (HIF-PH2) Prolyl hydroxylase domain-containing protein 2 (PHD2)
Type:
Protein
Mol. Mass.:
46035.59
Organism:
Homo sapiens (Human)
Description:
Q9GZT9
Residue:
426
  
Inhibitor
Name:
BDBM50044979
Synonyms:
CHEMBL3310254
Type:
Small organic molecule
Emp. Form.:
C12H8N4O4
Mol. Mass.:
272.2163
SMILES:
OC(=O)Cc1cnc([nH]c1=O)-c1ncc(cc1O)C#N
: