Target
Egl nine homolog 1
Ligand
BDBM50045041
Substrate
Meas. Tech.
ChEMBL_1451795 (CHEMBL3362036)
IC50
7300±n/a nM
Citation
 Hong, YRKim, HTRo, SCho, JMLee, SHKim, ISJung, YH Discovery of novel 2-[2-(3-hydroxy-pyridin-2-yl)-thiazol-4-yl]-acetamide derivatives as HIF prolyl 4-hydroxylase inhibitors; SAR, synthesis and modeling evaluation. Bioorg Med Chem Lett 24:3142-5 (2014)  
Target
Name:
Egl nine homolog 1
Synonyms:
C1orf12 EGLN1_HUMAN Hypoxia-inducible factor prolyl hydroxylase 2 (HIF-PH2) Prolyl hydroxylase domain-containing protein 2 (PHD2)
Type:
Protein
Mol. Mass.:
46035.59
Organism:
Homo sapiens (Human)
Description:
Q9GZT9
Residue:
426
  
Inhibitor
Name:
BDBM50045041
Synonyms:
CHEMBL3310394
Type:
Small organic molecule
Emp. Form.:
C15H14N4O4S
Mol. Mass.:
346.361
SMILES:
CC(C)(NC(=O)Cc1csc(n1)-c1ncc(cc1O)C#N)C(O)=O
: