Target
Cathepsin B
Ligand
BDBM91543
Substrate
Meas. Tech.
ChEMBL_1459865 (CHEMBL3367288)
Ki
90900±n/a nM
Citation
 Raghav, NSingh, M SAR studies of differently functionalized chalcones based hydrazones and their cyclized derivatives as inhibitors of mammalian cathepsin B and cathepsin H. Bioorg Med Chem 22:4233-45 (2014)  
Target
Name:
Cathepsin B
Synonyms:
Type:
Protein
Mol. Mass.:
36777.57
Organism:
Capra hircus (Goat)
Description:
Residue:
335
  
Inhibitor
Name:
BDBM91543
Synonyms:
1,3,5-triphenyl-2-pyrazoline VU0466999-1 | cid_95937
Type:
Small organic molecule
Emp. Form.:
C21H18N2
Mol. Mass.:
298.381
SMILES:
C1C(N(N=C1c1ccccc1)c1ccccc1)c1ccccc1
: