Target
5-hydroxytryptamine receptor 7
Ligand
BDBM50045493
Substrate
Meas. Tech.
ChEMBL_1447540 (CHEMBL3373147)
Ki
87±n/a nM
Citation
 Moritomo, AYamada, HWatanabe, TItahana, HKoga, YAkuzawa, SOkada, M Synthesis and structure-activity relationships of new carbonyl guanidine derivatives as novel dual 5-HT2B and 5-HT7 receptor antagonists. Part 2. Bioorg Med Chem 22:4323-37 (2014)  
Target
Name:
5-hydroxytryptamine receptor 7
Synonyms:
5-HT-7 5-HT7 5-HT7S 5HT7 HTR7 | Serotonin receptor 7
Type:
G Protein-Coupled Receptor (GPCR)
Mol. Mass.:
53573.08
Organism:
Homo sapiens (Human)
Description:
P34969
Residue:
479
  
Inhibitor
Name:
BDBM50045493
Synonyms:
CHEMBL3310116
Type:
Small organic molecule
Emp. Form.:
C16H16ClN3O2
Mol. Mass.:
317.77
SMILES:
Cl.[#6]-c1cccc2-c3ccc(cc3-[#6](-[#8])-c12)-[#6](=O)\[#7]=[#6](/[#7])-[#7]
: