Target
5-hydroxytryptamine receptor 7
Ligand
BDBM50045484
Substrate
Meas. Tech.
ChEMBL_1447540 (CHEMBL3373147)
Ki
43±n/a nM
Citation
 Moritomo, AYamada, HWatanabe, TItahana, HKoga, YAkuzawa, SOkada, M Synthesis and structure-activity relationships of new carbonyl guanidine derivatives as novel dual 5-HT2B and 5-HT7 receptor antagonists. Part 2. Bioorg Med Chem 22:4323-37 (2014)  
Target
Name:
5-hydroxytryptamine receptor 7
Synonyms:
5-HT-7 5-HT7 5-HT7S 5HT7 HTR7 | Serotonin receptor 7
Type:
G Protein-Coupled Receptor (GPCR)
Mol. Mass.:
53573.08
Organism:
Homo sapiens (Human)
Description:
P34969
Residue:
479
  
Inhibitor
Name:
BDBM50045484
Synonyms:
CHEMBL3310120
Type:
Small organic molecule
Emp. Form.:
C15H15ClN4O
Mol. Mass.:
302.759
SMILES:
Cl.[#7]-[#6]-1-c2ccccc2-c2ccc(cc-12)-[#6](=O)\[#7]=[#6](/[#7])-[#7]
: