Target
Transient receptor potential cation channel subfamily V member 1
Ligand
BDBM50046295
Substrate
Meas. Tech.
ChEMBL_1447595 (CHEMBL3374353)
Ki
0.200000±n/a nM
Citation
 Ryu, HSeo, SCho, SHKim, HSJung, AKang, DWSon, KCui, MHong, SHSharma, PKChoi, SBlumberg, PMFrank-Foltyn, RBahrenberg, GStockhausen, HSchiene, KChristoph, TFrormann, SLee, J 2-Alkyl/alkenyl substituted pyridine C-region analogues of 2-(3-fluoro-4-methylsulfonylaminophenyl)propanamides as highly potent TRPV1 antagonists. Bioorg Med Chem Lett 24:4039-43 (2014)  
Target
Name:
Transient receptor potential cation channel subfamily V member 1
Synonyms:
Capsaicin receptor Osm-9-like TRP channel 1 TRPV1_HUMAN Transient receptor potential cation channel subfamily V member 1 (TRPV1) Transient receptor potential cation channel subfamily V member 1(TRPV1) Vanilloid VR1 Vanilloid receptor 1 Vanilloid receptor 1 (VRI/TRPV1)
Type:
Protein
Mol. Mass.:
94960.75
Organism:
Homo sapiens (Human)
Description:
Q8NER1
Residue:
839
  
Inhibitor
Name:
BDBM50046295
Synonyms:
CHEMBL3314389
Type:
Small organic molecule
Emp. Form.:
C23H27F4N3O3S
Mol. Mass.:
501.537
SMILES:
CC(C(=O)NCc1ccc(nc1C1CCCCC1)C(F)(F)F)c1ccc(NS(C)(=O)=O)c(F)c1
: