Target
Adenosine receptor A3
Ligand
BDBM50047918
Substrate
Meas. Tech.
ChEMBL_1451991 (CHEMBL3363693)
Ki
1.5±n/a nM
Citation
 Tosh, DKPaoletta, SChen, ZMoss, SMGao, ZGSalvemini, DJacobson, KA Extended N(6) substitution of rigid C2-arylethynyl nucleosides for exploring the role of extracellular loops in ligand recognition at the A3 adenosine receptor. Bioorg Med Chem Lett 24:3302-6 (2014)  
Target
Name:
Adenosine receptor A3
Synonyms:
A3 adenosine receptor (hA3) ADORA3 | Adenosine A3 receptor (A3AR)
Type:
G Protein-Coupled Receptor (GPCR)
Mol. Mass.:
36197.32
Organism:
Homo sapiens (Human)
Description:
P0DMS8
Residue:
318
  
Inhibitor
Name:
BDBM50047918
Synonyms:
CHEMBL3311284
Type:
Small organic molecule
Emp. Form.:
C21H20N6O3
Mol. Mass.:
404.4219
SMILES:
[H][C@]12C[C@]1([C@@H](O)[C@@H](O)[C@@H]2n1cnc2c(N)nc(nc12)C#Cc1ccccc1)C(=O)NC
: