Target
Adenosine receptor A3
Ligand
BDBM50048058
Substrate
Meas. Tech.
ChEMBL_1452897 (CHEMBL3366213)
Ki
39±n/a nM
Citation
 Federico, SCiancetta, APorta, NRedenti, SPastorin, GCacciari, BKlotz, KNMoro, SSpalluto, G Scaffold decoration at positions 5 and 8 of 1,2,4-triazolo[1,5-c]pyrimidines to explore the antagonist profiling on adenosine receptors: a preliminary structure-activity relationship study. J Med Chem 57:6210-25 (2014)  
Target
Name:
Adenosine receptor A3
Synonyms:
A3 adenosine receptor (hA3) ADORA3 | Adenosine A3 receptor (A3AR)
Type:
G Protein-Coupled Receptor (GPCR)
Mol. Mass.:
36197.32
Organism:
Homo sapiens (Human)
Description:
P0DMS8
Residue:
318
  
Inhibitor
Name:
BDBM50048058
Synonyms:
CHEMBL3314871
Type:
Small organic molecule
Emp. Form.:
C21H21N5O5
Mol. Mass.:
423.4219
SMILES:
CCOC(=O)c1cnc(NCc2ccc(OC)c(OC)c2)n2nc(nc12)-c1ccco1
: