Target
Galectin-3
Ligand
BDBM50243888
Substrate
Meas. Tech.
ChEMBL_1454623 (CHEMBL3361812)
Kd
4400000±n/a nM
Citation
 Rajput, VKLeffler, HNilsson, UJMukhopadhyay, B Synthesis and evaluation of iminocoumaryl and coumaryl derivatized glycosides as galectin antagonists. Bioorg Med Chem Lett 24:3516-20 (2014)  
Target
Name:
Galectin-3
Synonyms:
LEG3_HUMAN MAC2
Type:
Enzyme
Mol. Mass.:
26156.54
Organism:
Homo sapiens (Human)
Description:
P17931
Residue:
250
  
Inhibitor
Name:
BDBM50243888
Synonyms:
CHEMBL442951 methyl beta-D-galactoside
Type:
Small organic molecule
Emp. Form.:
C7H14O6
Mol. Mass.:
194.1825
SMILES:
CO[C@@H]1O[C@H](CO)[C@H](O)[C@H](O)[C@H]1O
: