Target
Carbonic anhydrase 12
Ligand
BDBM50050786
Substrate
Meas. Tech.
ChEMBL_1459255 (CHEMBL3367485)
Ki
170±n/a nM
Citation
 De Monte, CCarradori, SSecci, DD'Ascenzio, MVullo, DCeruso, MSupuran, CT Cyclic tertiary sulfamates: selective inhibition of the tumor-associated carbonic anhydrases IX and XII by N- and O-substituted acesulfame derivatives. Eur J Med Chem 84:240-6 (2014)  
Target
Name:
Carbonic anhydrase 12
Synonyms:
CA-XII CAH12_HUMAN Carbonic anhydrase Carbonic anhydrase XII Carbonic anhydrase XII (CAXII) | Tumor antigen HOM-RCC-3.1.3
Type:
Enzyme
Mol. Mass.:
39456.00
Organism:
Homo sapiens (Human)
Description:
Catalytic domain of human cloned isozyme was used in the assay
Residue:
354
  
Inhibitor
Name:
BDBM50050786
Synonyms:
CHEMBL3322449
Type:
Small organic molecule
Emp. Form.:
C11H10BrNO4S
Mol. Mass.:
332.17
SMILES:
CC1=CC(=O)N(Cc2cccc(Br)c2)S(=O)(=O)O1
: