Target
N-lysine methyltransferase KMT5A
Ligand
BDBM50051131
Substrate
Meas. Tech.
ChEMBL_1450359 (CHEMBL3378196)
IC50
94000±n/a nM
Citation
 Ma, AYu, WLi, FBleich, RMHerold, JMButler, KVNorris, JLKorboukh, VTripathy, AJanzen, WPArrowsmith, CHFrye, SVVedadi, MBrown, PJJin, J Discovery of a selective, substrate-competitive inhibitor of the lysine methyltransferase SETD8. J Med Chem 57:6822-33 (2014)  
Target
Name:
N-lysine methyltransferase KMT5A
Synonyms:
KMT5A N-lysine methyltransferase SETD8 SET domain-containing protein 8 (SetD8) SET8 | SETD8
Type:
Enzyme
Mol. Mass.:
42919.11
Organism:
Homo sapiens (Human)
Description:
Q9NQR1
Residue:
393
  
Inhibitor
Name:
BDBM50051131
Synonyms:
CHEMBL3318299
Type:
Small organic molecule
Emp. Form.:
C24H37N5O2
Mol. Mass.:
427.5829
SMILES:
COc1cc2nc(nc(NCCCCCN3CCCC3)c2cc1OC)N1CCCCC1
: