Target
Histone-lysine N-methyltransferase KMT5C
Ligand
BDBM50051117
Substrate
Meas. Tech.
ChEMBL_1450374 (CHEMBL3378211)
IC50
>100000±n/a nM
Citation
 Ma, AYu, WLi, FBleich, RMHerold, JMButler, KVNorris, JLKorboukh, VTripathy, AJanzen, WPArrowsmith, CHFrye, SVVedadi, MBrown, PJJin, J Discovery of a selective, substrate-competitive inhibitor of the lysine methyltransferase SETD8. J Med Chem 57:6822-33 (2014)  
Target
Name:
Histone-lysine N-methyltransferase KMT5C
Synonyms:
Histone-lysine N-methyltransferase SUV420H2 KMT5C_HUMAN Protein lysine methyltransferase SUV4-20H2 (SUV4-20H2) Su(var)4-20 homolog 2 Suv4-20h2
Type:
Enzyme
Mol. Mass.:
52147.69
Organism:
Homo sapiens (Human)
Description:
Q86Y97
Residue:
462
  
Inhibitor
Name:
BDBM50051117
Synonyms:
CHEMBL3318285
Type:
Small organic molecule
Emp. Form.:
C23H35N5O2
Mol. Mass.:
413.5563
SMILES:
COc1cc2nc(nc(NCCCCCN3CCCC3)c2cc1OC)N1CCCC1
: