Target
Histone-lysine N-methyltransferase, H3 lysine-79 specific
Ligand
BDBM50051117
Substrate
Meas. Tech.
ChEMBL_1450378 (CHEMBL3378782)
IC50
>100000±n/a nM
Citation
 Ma, AYu, WLi, FBleich, RMHerold, JMButler, KVNorris, JLKorboukh, VTripathy, AJanzen, WPArrowsmith, CHFrye, SVVedadi, MBrown, PJJin, J Discovery of a selective, substrate-competitive inhibitor of the lysine methyltransferase SETD8. J Med Chem 57:6822-33 (2014)  
Target
Name:
Histone-lysine N-methyltransferase, H3 lysine-79 specific
Synonyms:
2.1.1.43 DOT1-like protein (Dot1L) DOT1L_HUMAN Histone H3-K79 methyltransferase Histone Methyltransferase DOT1L KIAA1814 Lysine N-methyltransferase 4
Type:
Protein
Mol. Mass.:
184911.91
Organism:
Homo sapiens (Human)
Description:
Q8TEK3
Residue:
1537
  
Inhibitor
Name:
BDBM50051117
Synonyms:
CHEMBL3318285
Type:
Small organic molecule
Emp. Form.:
C23H35N5O2
Mol. Mass.:
413.5563
SMILES:
COc1cc2nc(nc(NCCCCCN3CCCC3)c2cc1OC)N1CCCC1
: