Target
E3 ubiquitin-protein ligase Mdm2
Ligand
BDBM50053052
Substrate
Meas. Tech.
ChEMBL_1458455 (CHEMBL3370341)
IC50
0.096000±n/a nM
Citation
 Wang, YZhu, JLiu, JJChen, XMihalic, JDeignan, JYu, MSun, DKayser, FMcGee, LRLo, MCChen, AZhou, JYe, QHuang, XLong, AMYakowec, POliner, JDOlson, SHMedina, JC Optimization beyond AMG 232: discovery and SAR of sulfonamides on a piperidinone scaffold as potent inhibitors of the MDM2-p53 protein-protein interaction. Bioorg Med Chem Lett 24:3782-5 (2014)  
Target
Name:
E3 ubiquitin-protein ligase Mdm2
Synonyms:
Double minute 2 protein E3 ubiquitin-protein ligase Mdm2 (p53-binding protein Mdm2) Human Double Minute 2 (HDM2) MDM2-MDMX p53-Binding Protein MDM2 | p53-binding protein
Type:
Oncoprotein
Mol. Mass.:
55196.54
Organism:
Homo sapiens (Human)
Description:
Q00987
Residue:
491
  
Inhibitor
Name:
BDBM50053052
Synonyms:
CHEMBL3318767 US9593129, Example 379
Type:
Small organic molecule
Emp. Form.:
C29H34Cl2N2O6S
Mol. Mass.:
609.561
SMILES:
C[C@]1(CC(O)=O)C[C@@H]([C@H](N([C@H](CS(=O)(=O)N2CCOCC2)C2CC2)C1=O)c1ccc(Cl)cc1)c1cccc(Cl)c1
: