Target
D(2) dopamine receptor
Ligand
BDBM50053409
Substrate
Meas. Tech.
ChEMBL_1460137 (CHEMBL3369122)
Ki
1.1±n/a nM
Citation
 Salama, ILöber, SHübner, HGmeiner, P Synthesis and binding profile of haloperidol-based bivalent ligands targeting dopamine D(2)-like receptors. Bioorg Med Chem Lett 24:3753-6 (2014)  
Target
Name:
D(2) dopamine receptor
Synonyms:
D(2) dopamine receptor DOPAMINE D2 Long DRD2 Dopamine D2 receptor Dopamine D2 receptor (D2R) Dopamine2-like | d2
Type:
Cell-surface receptors
Mol. Mass.:
50647.10
Organism:
Homo sapiens (Human)
Description:
P14416
Residue:
443
  
Inhibitor
Name:
BDBM50053409
Synonyms:
CHEMBL3318846
Type:
Small organic molecule
Emp. Form.:
C52H60Cl2F2N4O6
Mol. Mass.:
945.959
SMILES:
Fc1ccc(cc1)C(=O)CCCN1CCC(CC1)(OC(=O)CCN1CCN(CCC(=O)OC2(CCN(CCCC(=O)c3ccc(F)cc3)CC2)c2ccc(Cl)cc2)CC1)c1ccc(Cl)cc1
: