Target
Eukaryotic elongation factor 2 kinase
Ligand
BDBM50053579
Substrate
Meas. Tech.
ChEMBL_1446963 (CHEMBL3373720)
IC50
>25000±n/a nM
Citation
 Edupuganti, RWang, QTavares, CDChitjian, CABachman, JLRen, PAnslyn, EVDalby, KN Synthesis and biological evaluation of pyrido[2,3-d]pyrimidine-2,4-dione derivatives as eEF-2K inhibitors. Bioorg Med Chem 22:4910-6 (2014)  
Target
Name:
Eukaryotic elongation factor 2 kinase
Synonyms:
Calcium/calmodulin-dependent eukaryotic elongation factor 2 kinase EF2K_HUMAN Eukaryotic elongation factor 2 kinase (eEF-2K) eEF-2 kinase | eEF-2K
Type:
Protein
Mol. Mass.:
82116.99
Organism:
Homo sapiens (Human)
Description:
Residue:
725
  
Inhibitor
Name:
BDBM50053579
Synonyms:
CHEMBL3326368
Type:
Small organic molecule
Emp. Form.:
C15H18N4O4
Mol. Mass.:
318.3278
SMILES:
CCOC(=O)c1cc2c(nc1N)n(C1CC1)c(=O)n(CC)c2=O
: