Target
Tyrosine-protein phosphatase non-receptor type 11
Ligand
BDBM50054403
Substrate
Meas. Tech.
ChEMBL_1458320 (CHEMBL3369282)
IC50
770±n/a nM
Citation
 Zeng, LFZhang, RYYu, ZHLi, SWu, LGunawan, AMLane, BSMali, RSLi, XChan, RJKapur, RWells, CDZhang, ZY Therapeutic potential of targeting the oncogenic SHP2 phosphatase. J Med Chem 57:6594-609 (2014)  
Target
Name:
Tyrosine-protein phosphatase non-receptor type 11
Synonyms:
PTN11_HUMAN PTP-2C PTPN11 Protein tyrosine phosphatase (PTP) Shp2 Protein-tyrosine phosphatase 2C SHP2 Src homology phosphatase 2 (SHP-2) Tyrosine-protein phosphatase non-receptor type 11 (PTPN11) Tyrosine-protein phosphatase non-receptor type 11 (SHP2)
Type:
Protein phosphatase
Mol. Mass.:
68443.59
Organism:
Homo sapiens (Human)
Description:
Q06124
Residue:
597
  
Inhibitor
Name:
BDBM50054403
Synonyms:
CHEMBL3319360 US9844535, ID 11a-5 (L97M48)
Type:
Small organic molecule
Emp. Form.:
C30H22IN3O5
Mol. Mass.:
631.4173
SMILES:
Cn1c(c(I)c2cc(C(O)=O)c(O)cc12)-c1cccc(NC(=O)C(=O)Nc2cccc(c2)-c2ccccc2)c1
: