Target
Tyrosine-protein phosphatase non-receptor type 14
Ligand
BDBM50054344
Substrate
Meas. Tech.
ChEMBL_1458334 (CHEMBL3369527)
IC50
5300±n/a nM
Citation
 Zeng, LFZhang, RYYu, ZHLi, SWu, LGunawan, AMLane, BSMali, RSLi, XChan, RJKapur, RWells, CDZhang, ZY Therapeutic potential of targeting the oncogenic SHP2 phosphatase. J Med Chem 57:6594-609 (2014)  
Target
Name:
Tyrosine-protein phosphatase non-receptor type 14
Synonyms:
PEZ PTN14_HUMAN PTPN14 Tyrosine-protein phosphatase non-receptor type 14
Type:
Enzyme
Mol. Mass.:
135291.73
Organism:
Homo sapiens (Human)
Description:
Q15678
Residue:
1187
  
Inhibitor
Name:
BDBM50054344
Synonyms:
CHEMBL3319356 US9844535, ID 11a-1 L97M74
Type:
Small organic molecule
Emp. Form.:
C28H20IN3O5S
Mol. Mass.:
637.445
SMILES:
Cn1c(c(I)c2cc(C(O)=O)c(O)cc12)-c1cccc(NC(=O)C(=O)Nc2ccc(cc2)-c2ccsc2)c1
: