Target
Ubiquitin-like domain-containing CTD phosphatase 1
Ligand
BDBM50054344
Substrate
Meas. Tech.
ChEMBL_1458336 (CHEMBL3369529)
IC50
9700±n/a nM
Citation
 Zeng, LFZhang, RYYu, ZHLi, SWu, LGunawan, AMLane, BSMali, RSLi, XChan, RJKapur, RWells, CDZhang, ZY Therapeutic potential of targeting the oncogenic SHP2 phosphatase. J Med Chem 57:6594-609 (2014)  
Target
Name:
Ubiquitin-like domain-containing CTD phosphatase 1
Synonyms:
Nuclear proteasome inhibitor UBLCP1 UBLCP1 | Ubiquitin-like domain-containing CTD phosphatase 1
Type:
Enzyme
Mol. Mass.:
36803.71
Organism:
Homo sapiens (Human)
Description:
Q8WVY7
Residue:
318
  
Inhibitor
Name:
BDBM50054344
Synonyms:
CHEMBL3319356 US9844535, ID 11a-1 L97M74
Type:
Small organic molecule
Emp. Form.:
C28H20IN3O5S
Mol. Mass.:
637.445
SMILES:
Cn1c(c(I)c2cc(C(O)=O)c(O)cc12)-c1cccc(NC(=O)C(=O)Nc2ccc(cc2)-c2ccsc2)c1
: