Target
Adenosine receptor A1
Ligand
BDBM50055096
Substrate
Meas. Tech.
ChEMBL_1447965 (CHEMBL3379791)
IC50
2.4±n/a nM
Citation
 Squarcialupi, LColotta, VCatarzi, DVarano, FBetti, MVarani, KVincenzi, FBorea, PAPorta, NCiancetta, AMoro, S 7-Amino-2-phenylpyrazolo[4,3-d]pyrimidine derivatives: structural investigations at the 5-position to target human A1 and A(2A) adenosine receptors. Molecular modeling and pharmacological studies. Eur J Med Chem 84:614-27 (2014)  
Target
Name:
Adenosine receptor A1
Synonyms:
A1 adenosine receptor (hA1) AA1R_HUMAN ADORA1 Adenosine A1-receptor Adenosine receptor A1 (hA1) | Adenosine transporter (AdT)
Type:
G Protein-Coupled Receptor (GPCR)
Mol. Mass.:
36520.92
Organism:
Homo sapiens (Human)
Description:
P30542
Residue:
326
  
Inhibitor
Name:
BDBM50055096
Synonyms:
CHEMBL3317576
Type:
Small organic molecule
Emp. Form.:
C21H21N5O
Mol. Mass.:
359.4243
SMILES:
COc1cccc(CCCc2nc(N)c3nn(cc3n2)-c2ccccc2)c1
: