Target
Tyrosine-protein kinase Mer
Ligand
BDBM50055499
Substrate
Meas. Tech.
ChEMBL_1451317 (CHEMBL3363336)
Ki
0.330000±n/a nM
Citation
 Zhang, WDeRyckere, DHunter, DLiu, JStashko, MAMinson, KACummings, CTLee, MGlaros, TGNewton, DLSather, SZhang, DKireev, DJanzen, WPEarp, HSGraham, DKFrye, SVWang, X UNC2025, a potent and orally bioavailable MER/FLT3 dual inhibitor. J Med Chem 57:7031-41 (2014)  
Target
Name:
Tyrosine-protein kinase Mer
Synonyms:
MER MERTK Proto-oncogene c-Mer Receptor tyrosine kinase MerTK | Tyrosine-protein kinase Mer
Type:
PROTEIN
Mol. Mass.:
110234.77
Organism:
Homo sapiens (Human)
Description:
ChEMBL_1498723
Residue:
999
  
Inhibitor
Name:
BDBM50055499
Synonyms:
CHEMBL3326002
Type:
Small organic molecule
Emp. Form.:
C25H34N6O4S
Mol. Mass.:
514.64
SMILES:
CCCCNc1ncc2c(nn([C@H]3CC[C@H](O)CC3)c2n1)-c1ccc(cc1)S(=O)(=O)N1CCOCC1
: