Target
Tyrosine-protein kinase receptor UFO
Ligand
BDBM50055497
Substrate
Meas. Tech.
ChEMBL_1451337 (CHEMBL3363356)
IC50
32±n/a nM
Citation
 Zhang, WDeRyckere, DHunter, DLiu, JStashko, MAMinson, KACummings, CTLee, MGlaros, TGNewton, DLSather, SZhang, DKireev, DJanzen, WPEarp, HSGraham, DKFrye, SVWang, X UNC2025, a potent and orally bioavailable MER/FLT3 dual inhibitor. J Med Chem 57:7031-41 (2014)  
Target
Name:
Tyrosine-protein kinase receptor UFO
Synonyms:
AXL TEL/AXL UFO | UFO_HUMAN
Type:
Enzyme
Mol. Mass.:
98316.97
Organism:
Homo sapiens (Human)
Description:
P30530
Residue:
894
  
Inhibitor
Name:
BDBM50055497
Synonyms:
CHEMBL3326005
Type:
Small organic molecule
Emp. Form.:
C28H37FN6O3S
Mol. Mass.:
556.695
SMILES:
CN1CCN(CC1)S(=O)(=O)c1ccc(-c2cn([C@H]3CC[C@H](O)CC3)c3nc(NCCC4CC4)ncc23)c(F)c1
: