Target
Mast/stem cell growth factor receptor Kit
Ligand
BDBM50055496
Substrate
Meas. Tech.
ChEMBL_1451344 (CHEMBL3363363)
IC50
8.2±n/a nM
Citation
 Zhang, WDeRyckere, DHunter, DLiu, JStashko, MAMinson, KACummings, CTLee, MGlaros, TGNewton, DLSather, SZhang, DKireev, DJanzen, WPEarp, HSGraham, DKFrye, SVWang, X UNC2025, a potent and orally bioavailable MER/FLT3 dual inhibitor. J Med Chem 57:7031-41 (2014)  
Target
Name:
Mast/stem cell growth factor receptor Kit
Synonyms:
CD117 antigen KIT Mast/stem cell growth factor receptor Kit (cKIT) Proto-oncogene tyrosine-protein kinase Kit Stem cell growth factor receptor Tyrosine-protein kinase Kit c-kit v-kit Hardy-Zuckerman 4 feline sarcoma viral oncogene homolog
Type:
Protein
Mol. Mass.:
109869.37
Organism:
Homo sapiens (Human)
Description:
P10721
Residue:
976
  
Inhibitor
Name:
BDBM50055496
Synonyms:
CHEMBL3326006
Type:
Small organic molecule
Emp. Form.:
C28H40N6O
Mol. Mass.:
476.6568
SMILES:
CCCCNc1ncc2c(cn([C@H]3CC[C@H](O)CC3)c2n1)-c1ccc(CN2CCN(C)CC2)cc1
: