Target
D(4) dopamine receptor
Ligand
BDBM50185473
Substrate
Meas. Tech.
ChEMBL_1452246 (CHEMBL3366158)
Ki
12±n/a nM
Citation
 Sampson, DBricker, BZhu, XYPeprah, KLamango, NSSetola, VRoth, BLAblordeppey, SY Further evaluation of the tropane analogs of haloperidol. Bioorg Med Chem Lett 24:4294-7 (2014)  
Target
Name:
D(4) dopamine receptor
Synonyms:
D(4) dopamine receptor DOPAMINE D4.4 Dopamine receptor | Drd4
Type:
Enzyme Catalytic Domain
Mol. Mass.:
41307.65
Organism:
RAT
Description:
DOPAMINE D4.4 0 RAT::P30729
Residue:
387
  
Inhibitor
Name:
BDBM50185473
Synonyms:
4-(3-(4-chlorophenyl)-3-hydroxy-8-aza-bicyclo[3.2.1]octan-8-yl)-1-(4-fluorophenyl)butan-1-one 4-[3-(4-Chlorophenyl)-3-hydroxy-8-azabicyclo[3.2.1]oct-8-yl]-1-(4-fluorophenyl)butan-1-one | CHEMBL210578
Type:
Small organic molecule
Emp. Form.:
C23H25ClFNO2
Mol. Mass.:
401.902
SMILES:
OC1(CC2CCC(C1)N2CCCC(=O)c1ccc(F)cc1)c1ccc(Cl)cc1
: