Target
Cathepsin D
Ligand
BDBM50055908
Substrate
Meas. Tech.
ChEMBL_1458606 (CHEMBL3371149)
IC50
330±n/a nM
Citation
 Grädler, UCzodrowski, PTsaklakidis, CKlein, MWerkmann, DLindemann, SMaskos, KLeuthner, B Structure-based optimization of non-peptidic Cathepsin D inhibitors. Bioorg Med Chem Lett 24:4141-50 (2014)  
Target
Name:
Cathepsin D
Synonyms:
CATD_BOVIN | CTSD
Type:
PROTEIN
Mol. Mass.:
42158.92
Organism:
Bos taurus
Description:
ChEMBL_1458606
Residue:
387
  
Inhibitor
Name:
BDBM50055908
Synonyms:
CHEMBL3321925 | US9884814, Compound 141
Type:
Small organic molecule
Emp. Form.:
C29H34N4O6
Mol. Mass.:
534.6035
SMILES:
COc1ccc(CNC(=O)[C@@H](Cc2ccccc2)NC(=N)NC(=O)Cc2ccc(OC)c(OC)c2)cc1OC
: