Target
Glycogen phosphorylase, muscle form
Ligand
BDBM50056221
Substrate
Meas. Tech.
ChEMBL_1449751 (CHEMBL3378174)
Ki
1.6±n/a nM
Citation
 Parmenopoulou, VKantsadi, ALTsirkone, VGChatzileontiadou, DSManta, SZographos, SEMolfeta, CArchontis, GAgius, LHayes, JMLeonidas, DDKomiotis, D Structure based inhibitor design targeting glycogen phosphorylase B. Virtual screening, synthesis, biochemical and biological assessment of novel N-acyl-ß-d-glucopyranosylamines. Bioorg Med Chem 22:4810-25 (2014)  
Target
Name:
Glycogen phosphorylase, muscle form
Synonyms:
Glycogen phosphorylase, muscle form Myophosphorylase PYGM_HUMAN
Type:
PROTEIN
Mol. Mass.:
97097.45
Organism:
Homo sapiens (Human)
Description:
ChEMBL_1449751
Residue:
842
  
Inhibitor
Name:
BDBM50056221
Synonyms:
CHEMBL3322297
Type:
Small organic molecule
Emp. Form.:
C7H7NO4
Mol. Mass.:
169.1348
SMILES:
OC(=O)C1=C(NC=CC1)C(O)=O
: