Target
Glycogen phosphorylase, liver form
Ligand
BDBM50351158
Substrate
Meas. Tech.
ChEMBL_1449752 (CHEMBL3378175)
Ki
4900000±n/a nM
Citation
 Parmenopoulou, VKantsadi, ALTsirkone, VGChatzileontiadou, DSManta, SZographos, SEMolfeta, CArchontis, GAgius, LHayes, JMLeonidas, DDKomiotis, D Structure based inhibitor design targeting glycogen phosphorylase B. Virtual screening, synthesis, biochemical and biological assessment of novel N-acyl-ß-d-glucopyranosylamines. Bioorg Med Chem 22:4810-25 (2014)  
Target
Name:
Glycogen phosphorylase, liver form
Synonyms:
Glycogen Phosphorylase (PYGL) Liver glycogen phosphorylase PYGL_HUMAN
Type:
Homodimer
Mol. Mass.:
97153.98
Organism:
Homo sapiens (Human)
Description:
Dimers associate into a tetramer to form the enzymatically active phosphorylase A.
Residue:
847
  
Inhibitor
Name:
BDBM50351158
Synonyms:
CHEMBL423707
Type:
Small organic molecule
Emp. Form.:
C6H12O6
Mol. Mass.:
180.1559
SMILES:
OC[C@H]1O[C@H](O)[C@H](O)[C@@H](O)[C@@H]1O
: